Target
DNA polymerase beta
Ligand
BDBM50239939
Substrate
Meas. Tech.
ChEMBL_1667556 (CHEMBL4017352)
IC50
>100000±n/a nM
Citation
 Zhou, SMahmoud, SLiu, PZhou, LEhteshami, MBassit, LTao, SDomaoal, RASari, OSchutter, CAmiralaei, SKhalil, AOllinger Russell, OMcBrayer, TWhitaker, TAbou-Taleb, NAmblard, FCoats, SJSchinazi, RF 2'-Chloro,2'-fluoro Ribonucleotide Prodrugs with Potent Pan-genotypic Activity against Hepatitis C Virus Replication in Culture. J Med Chem 60:5424-5437 (2017)  
Target
Name:
DNA polymerase beta
Synonyms:
DNA polymerase beta (Pol β) POLB
Type:
Protein
Mol. Mass.:
38188.76
Organism:
Homo sapiens (Human)
Description:
Residue:
335
  
Inhibitor
Name:
BDBM50239939
Synonyms:
CHEMBL4088430
Type:
Small organic molecule
Emp. Form.:
C9H13ClFN2O14P3
Mol. Mass.:
520.577
SMILES:
O[C@@H]1[C@@H](COP(O)(=O)OP(O)(=O)OP(O)(O)=O)O[C@@H](n2ccc(=O)[nH]c2=O)[C@@]1(F)Cl
: