Target
DNA polymerase beta
Ligand
BDBM50333129
Substrate
Meas. Tech.
ChEMBL_1667556 (CHEMBL4017352)
IC50
>100000±n/a nM
Citation
 Zhou, SMahmoud, SLiu, PZhou, LEhteshami, MBassit, LTao, SDomaoal, RASari, OSchutter, CAmiralaei, SKhalil, AOllinger Russell, OMcBrayer, TWhitaker, TAbou-Taleb, NAmblard, FCoats, SJSchinazi, RF 2'-Chloro,2'-fluoro Ribonucleotide Prodrugs with Potent Pan-genotypic Activity against Hepatitis C Virus Replication in Culture. J Med Chem 60:5424-5437 (2017)  
Target
Name:
DNA polymerase beta
Synonyms:
DNA polymerase beta (Pol β) POLB
Type:
Protein
Mol. Mass.:
38188.76
Organism:
Homo sapiens (Human)
Description:
Residue:
335
  
Inhibitor
Name:
BDBM50333129
Synonyms:
((2R,3R,4R,5R)-5-(2,4-dioxo-3,4-dihydropyrimidin-1(2H)-yl)-4-fluoro-3-hydroxy-4-methyltetrahydrofuran-2-yl)methyl tetrahydrogen triphosphate CHEMBL486231 | beta-D-2'-deoxy-2'-fluoro-2'-C-methyluridine triphosphate
Type:
Small organic molecule
Emp. Form.:
C10H16FN2O14P3
Mol. Mass.:
500.1587
SMILES:
C[C@@]1(F)[C@H](O)[C@@H](COP(O)(=O)OP(O)(=O)OP(O)(O)=O)O[C@H]1n1ccc(=O)[nH]c1=O
: