Target
Bile salt export pump
Ligand
BDBM50115102
Substrate
Meas. Tech.
ChEMBL_1667662 (CHEMBL4017550)
IC50
>1000000±n/a nM
Citation
 Warner, DJChen, HCantin, LDKenna, JGStahl, SWalker, CLNoeske, T Mitigating the inhibition of human bile salt export pump by drugs: opportunities provided by physicochemical property modulation, in silico modeling, and structural modification. Drug Metab Dispos 40:2332-41 (2012)  
Target
Name:
Bile salt export pump
Synonyms:
ABCB11 ATP-binding cassette sub-family B member 11 Bile Salt Export Pump, BSEP Bile salt export pump (BSEP)
Type:
Protein
Mol. Mass.:
146405.49
Organism:
Homo sapiens (Human)
Description:
O95342
Residue:
1321
  
Inhibitor
Name:
BDBM50115102
Synonyms:
(1-Hydroxy-1-phosphono-ethyl)-phosphonic acid Didronel Etidronic Acid
Type:
Small organic molecule
Emp. Form.:
C2H8O7P2
Mol. Mass.:
206.0282
SMILES:
CC(O)(P(O)(O)=O)P(O)(O)=O
: