Target
Bile salt export pump
Ligand
BDBM50418049
Substrate
Meas. Tech.
ChEMBL_1667662 (CHEMBL4017550)
IC50
127000±n/a nM
Citation
 Warner, DJChen, HCantin, LDKenna, JGStahl, SWalker, CLNoeske, T Mitigating the inhibition of human bile salt export pump by drugs: opportunities provided by physicochemical property modulation, in silico modeling, and structural modification. Drug Metab Dispos 40:2332-41 (2012)  
Target
Name:
Bile salt export pump
Synonyms:
ABCB11 ATP-binding cassette sub-family B member 11 Bile Salt Export Pump, BSEP Bile salt export pump (BSEP)
Type:
Protein
Mol. Mass.:
146405.49
Organism:
Homo sapiens (Human)
Description:
O95342
Residue:
1321
  
Inhibitor
Name:
BDBM50418049
Synonyms:
CL 36467 LEVOMEPROMAZINE | med.21724, Compound 192
Type:
Small organic molecule
Emp. Form.:
C19H24N2OS
Mol. Mass.:
328.472
SMILES:
COc1ccc2Sc3ccccc3N(C[C@H](C)CN(C)C)c2c1
: