Target
Bile salt export pump
Ligand
BDBM50015950
Substrate
Meas. Tech.
ChEMBL_1667662 (CHEMBL4017550)
IC50
97210±n/a nM
Citation
 Warner, DJChen, HCantin, LDKenna, JGStahl, SWalker, CLNoeske, T Mitigating the inhibition of human bile salt export pump by drugs: opportunities provided by physicochemical property modulation, in silico modeling, and structural modification. Drug Metab Dispos 40:2332-41 (2012)  
Target
Name:
Bile salt export pump
Synonyms:
ABCB11 ATP-binding cassette sub-family B member 11 Bile Salt Export Pump, BSEP Bile salt export pump (BSEP)
Type:
Protein
Mol. Mass.:
146405.49
Organism:
Homo sapiens (Human)
Description:
O95342
Residue:
1321
  
Inhibitor
Name:
BDBM50015950
Synonyms:
1,3-bis(2-chloroethyl)-1-nitrosourea CARMUSTINE Gliadel | N,N'-Bis(2-chloroethyl)-N-nitrosourea
Type:
Small organic molecule
Emp. Form.:
C5H9Cl2N3O2
Mol. Mass.:
214.05
SMILES:
ClCCNC(=O)N(CCCl)N=O
: