Target
Bile salt export pump
Ligand
BDBM57048
Substrate
Meas. Tech.
ChEMBL_1667662 (CHEMBL4017550)
IC50
<10000±n/a nM
Citation
 Warner, DJChen, HCantin, LDKenna, JGStahl, SWalker, CLNoeske, T Mitigating the inhibition of human bile salt export pump by drugs: opportunities provided by physicochemical property modulation, in silico modeling, and structural modification. Drug Metab Dispos 40:2332-41 (2012)  
Target
Name:
Bile salt export pump
Synonyms:
ABCB11 ATP-binding cassette sub-family B member 11 Bile Salt Export Pump, BSEP Bile salt export pump (BSEP)
Type:
Protein
Mol. Mass.:
146405.49
Organism:
Homo sapiens (Human)
Description:
O95342
Residue:
1321
  
Inhibitor
Name:
BDBM57048
Synonyms:
FUSIDIC ACID SODIUM SALT SMR000059232 sodium;(2Z)-2-[(3R,4S,8S,9S,10S,11R,13R,14S,16S)-16-acetoxy-3,11-dihydroxy-4,8,10,14-tetramethyl-2,3,4,5,6,7,9,11,12,13,15,16-dodecahydro-1H-cyclopenta[a]phenanthren-17-ylidene]-6-methyl-hept-5-enoate sodium;(2Z)-2-[(3R,4S,8S,9S,10S,11R,13R,14S,16S)-16-acetyloxy-3,11-dihydroxy-4,8,10,14-tetramethyl-2,3,4,5,6,7,9,11,12,13,15,16-dodecahydro-1H-cyclopenta[a]phenanthren-17-ylidene]-6-methylhept-5-enoate | sodium;(2Z)-2-[(3R,4S,8S,9S,10S,11R,13R,14S,16S)-16-acetyloxy-4,8,10,14-tetramethyl-3,11-bis(oxidanyl)-2,3,4,5,6,7,9,11,12,13,15,16-dodecahydro-1H-cyclopenta[a]phenanthren-17-ylidene]-6-methyl-hept-5-enoate
Type:
Small organic molecule
Emp. Form.:
C31H47O6
Mol. Mass.:
515.7018
SMILES:
[#6]-[#6@@H]-1-[#6@H](-[#8])-[#6]-[#6][C@@]2([#6])[#6]-1-[#6]-[#6][C@@]1([#6])[#6@H]2-[#6@H](-[#8])-[#6]-[#6@H]2\[#6](-[#6@H](-[#6][C@]12[#6])-[#8]-[#6](-[#6])=O)=[#6](/[#6]-[#6]\[#6]=[#6](\[#6])-[#6])-[#6](-[#8-])=O
: