Target
Beta-secretase 1
Ligand
BDBM50240557
Substrate
Meas. Tech.
ChEBML_1668391
Ki
67±n/a nM
Citation
 Ghosh, AKBrindisi, MYen, YCCárdenas, ELElla-Menye, JRKumaragurubaran, NHuang, XTang, JMesecar, AD Design, synthesis, and X-ray structural studies of BACE-1 inhibitors containing substituted 2-oxopiperazines as P1'-P2' ligands. Bioorg Med Chem Lett 27:2432-2438 (2017)  
Target
Name:
Beta-secretase 1
Synonyms:
ASP2 Aspartyl protease 2 BACE1 Beta-secretase (BACE) Beta-secretase 1 (BACE 1) Beta-secretase 1 (BACE1) Beta-site amyloid precursor protein cleaving enzyme 1 Memapsin-2 beta-Secretase (BACE-1) | beta-Secretase (BACE1)
Type:
Protein
Mol. Mass.:
55755.10
Organism:
Homo sapiens (Human)
Description:
P56817
Residue:
501
  
Inhibitor
Name:
BDBM50240557
Synonyms:
CHEMBL4065655
Type:
Small organic molecule
Emp. Form.:
C36H43N5O5S
Mol. Mass.:
657.822
SMILES:
[H][C@]1(NCCN(Cc2ccccc2)C1=O)[C@@H](O)[C@H](Cc1ccccc1)NC(=O)c1cc2N(C)S(=O)(=O)C(C)(C)Cn3cc(CC)c(c1)c23
: