Target
Fibroblast growth factor receptor 3
Ligand
BDBM50240812
Substrate
Meas. Tech.
ChEMBL_1668739 (CHEMBL4018627)
IC50
>1000±n/a nM
Citation
 Zhu, WChen, HWang, YWang, JPeng, XChen, XGao, YLi, CHe, YAi, JGeng, MZheng, MLiu, H Design, Synthesis, and Pharmacological Evaluation of Novel Multisubstituted Pyridin-3-amine Derivatives as Multitargeted Protein Kinase Inhibitors for the Treatment of Non-Small Cell Lung Cancer. J Med Chem 60:6018-6035 (2017)  
Target
Name:
Fibroblast growth factor receptor 3
Synonyms:
CD_antigen: CD333 FGFR3 Fibroblast growth factor receptor JTK4
Type:
Protein
Mol. Mass.:
87699.57
Organism:
Homo sapiens (Human)
Description:
P22607
Residue:
806
  
Inhibitor
Name:
BDBM50240812
Synonyms:
CHEMBL4082023
Type:
Small organic molecule
Emp. Form.:
C28H26N4O2
Mol. Mass.:
450.5316
SMILES:
COc1ccccc1-c1ncc(N[C@@H](CO)c2ccccc2)cc1-c1ccc2[nH]nc(C)c2c1
: