Target
Ketohexokinase
Ligand
BDBM50241178
Substrate
Meas. Tech.
ChEMBL_1669645 (CHEMBL4019533)
IC50
340±n/a nM
Citation
 Huard, KAhn, KAmor, PBeebe, DABorzilleri, KAChrunyk, BACoffey, SBCong, YConn, ELCulp, JSDowling, MSGorgoglione, MFGutierrez, JAKnafels, JDLachapelle, EAPandit, JParris, KDPerez, SPfefferkorn, JAPrice, DARaymer, BRoss, TTShavnya, ASmith, ACSubashi, TATesz, GJThuma, BATu, MWeaver, JDWeng, YWithka, JMXing, GMagee, TV Discovery of Fragment-Derived Small Molecules for in Vivo Inhibition of Ketohexokinase (KHK). J Med Chem 60:7835-7849 (2017)  
Target
Name:
Ketohexokinase
Synonyms:
2.7.1.3 KHK_RAT Khk
Type:
PROTEIN
Mol. Mass.:
32749.44
Organism:
Rattus norvegicus
Description:
ChEMBL_117528
Residue:
298
  
Inhibitor
Name:
BDBM50241178
Synonyms:
CHEMBL4070442
Type:
Small organic molecule
Emp. Form.:
C16H19F3N4O3
Mol. Mass.:
372.3423
SMILES:
C[C@]1(O)CCN(C1)c1nc(cc(c1C#N)C(F)(F)F)N1C[C@H](O)[C@@H](O)C1
: