Target
Aldo-keto reductase family 1 member B10
Ligand
BDBM50241826
Substrate
Meas. Tech.
ChEMBL_1670539 (CHEMBL4020427)
IC50
7.5±n/a nM
Citation
 Endo, SXia, SSuyama, MMorikawa, YOguri, HHu, DAo, YTakahara, SHorino, YHayakawa, YWatanabe, YGouda, HHara, AKuwata, KToyooka, NMatsunaga, TIkari, A Synthesis of Potent and Selective Inhibitors of Aldo-Keto Reductase 1B10 and Their Efficacy against Proliferation, Metastasis, and Cisplatin Resistance of Lung Cancer Cells. J Med Chem 60:8441-8455 (2017)  
Target
Name:
Aldo-keto reductase family 1 member B10
Synonyms:
AK1BA_HUMAN AKR1B11 ARP Aldo-keto reductase family 1 member B10 (AKR1B10) Aldose reductase-like SI reductase hARP
Type:
Protein
Mol. Mass.:
36024.67
Organism:
Homo sapiens (Human)
Description:
O60218. 1ZUA; 4JII; 4GQ0
Residue:
316
  
Inhibitor
Name:
BDBM50241826
Synonyms:
CHEMBL4089816
Type:
Small organic molecule
Emp. Form.:
C26H24N2O5
Mol. Mass.:
444.4792
SMILES:
COc1ccc(cc1)\N=c1/oc2cc(O)ccc2cc1C(=O)NCCCc1cccc(O)c1
: