Target
cGMP-specific 3',5'-cyclic phosphodiesterase
Ligand
BDBM50241831
Substrate
Meas. Tech.
ChEBML_1670607
IC50
0.056000±n/a nM
Citation
 Fiorito, JVendome, JSaeed, FStaniszewski, AZhang, HYan, SDeng, SXArancio, OLandry, DW Identification of a Novel 1,2,3,4-Tetrahydrobenzo[b][1,6]naphthyridine Analogue as a Potent Phosphodiesterase 5 Inhibitor with Improved Aqueous Solubility for the Treatment of Alzheimer's Disease. J Med Chem 60:8858-8875 (2017)  
Target
Name:
cGMP-specific 3',5'-cyclic phosphodiesterase
Synonyms:
3',5'-cyclic phosphodiesterase PDE5 PDE5A_HUMAN Phosphodiesterase 5 (PDE5) Phosphodiesterase 5A (PDE5A) cGMP-specific 3',5'-cyclic phosphodiesterase
Type:
Protein
Mol. Mass.:
99975.83
Organism:
Homo sapiens (Human)
Description:
O76074
Residue:
875
  
Inhibitor
Name:
BDBM50241831
Synonyms:
CHEMBL4062273 US10899756, Compound U
Type:
Small organic molecule
Emp. Form.:
C23H21ClN4O2
Mol. Mass.:
420.891
SMILES:
COc1ccc(CNc2c3CN(CCc3nc3ccc(cc23)C#N)C(C)=O)cc1Cl
: