Target
Glucocorticoid receptor
Ligand
BDBM50242297
Substrate
Meas. Tech.
ChEMBL_1671516 (CHEMBL4021545)
IC50
>10000±n/a nM
Citation
 Aikawa, KAsano, MOno, KHabuka, NYano, JWilson, KFujita, HKandori, HHara, TMorimoto, MSantou, TYamaoka, MNakayama, MHasuoka, A Synthesis and biological evaluation of novel selective androgen receptor modulators (SARMs) Part III: Discovery of 4-(5-oxopyrrolidine-1-yl)benzonitrile derivative 2f as a clinical candidate. Bioorg Med Chem 25:3330-3349 (2017)  
Target
Name:
Glucocorticoid receptor
Synonyms:
GCR_HUMAN GRL Glucocorticoid receptor (GRFP) Nuclear receptor subfamily 3 group C member 1
Type:
Enzyme
Mol. Mass.:
85656.87
Organism:
Homo sapiens (Human)
Description:
P04150
Residue:
777
  
Inhibitor
Name:
BDBM50242297
Synonyms:
CHEMBL4088914
Type:
Small organic molecule
Emp. Form.:
C14H13F3N2O2
Mol. Mass.:
298.2604
SMILES:
CC[C@H]1[C@@H](O)CC(=O)N1c1ccc(C#N)c(c1)C(F)(F)F
: