Target
Mu-type opioid receptor
Ligand
BDBM50242689
Substrate
Meas. Tech.
ChEMBL_1672055 (CHEMBL4022084)
Ki
0.251189±n/a nM
Citation
 Jiang, LBeattie, DTJacobsen, JRKintz, SObedencio, GPSaito, DStergiades, IVickery, RGLong, DD Discovery of N-substituted-endo-3-(8-aza-bicyclo[3.2.1]oct-3-yl)-phenol and -phenyl carboxamide series of?-opioid receptor antagonists. Bioorg Med Chem Lett 27:2926-2930 (2017)  
Target
Name:
Mu-type opioid receptor
Synonyms:
M-OR-1 MOR-1 MUOR1 Mu opiate receptor OPRM1 hMOP | mu-type opioid receptor isoform MOR-1
Type:
G Protein-Coupled Receptor (GPCR)
Mol. Mass.:
44789.51
Organism:
Homo sapiens (Human)
Description:
P35372
Residue:
400
  
Inhibitor
Name:
BDBM50242689
Synonyms:
CHEMBL4069933
Type:
Small organic molecule
Emp. Form.:
C23H28N2O2
Mol. Mass.:
364.4806
SMILES:
[H][C@@]12CC[C@]([H])(CC(C1)c1cccc(c1)C(N)=O)N2CC(O)Cc1ccccc1
: