Target
Kappa-type opioid receptor
Ligand
BDBM50242680
Substrate
Meas. Tech.
ChEMBL_1672057 (CHEMBL4022086)
Ki
0.398107±n/a nM
Citation
 Jiang, LBeattie, DTJacobsen, JRKintz, SObedencio, GPSaito, DStergiades, IVickery, RGLong, DD Discovery of N-substituted-endo-3-(8-aza-bicyclo[3.2.1]oct-3-yl)-phenol and -phenyl carboxamide series of?-opioid receptor antagonists. Bioorg Med Chem Lett 27:2926-2930 (2017)  
Target
Name:
Kappa-type opioid receptor
Synonyms:
Kappa Opioid Receptor OPRK1 Opiate Kappa 1 | mu/kappa opioid receptor
Type:
G Protein-Coupled Receptor (GPCR)
Mol. Mass.:
42744.99
Organism:
Cavia porcellus (domestic guinea pig)
Description:
P41144
Residue:
380
  
Inhibitor
Name:
BDBM50242680
Synonyms:
CHEMBL4060795
Type:
Small organic molecule
Emp. Form.:
C21H32N2O
Mol. Mass.:
328.4916
SMILES:
[H][C@@]12CC[C@]([H])(C[C@H](C1)c1cccc(c1)C(N)=O)N2CCCCCCC
: