Target
Kappa-type opioid receptor
Ligand
BDBM50278337
Substrate
Meas. Tech.
ChEMBL_1672057 (CHEMBL4022086)
Ki
20±n/a nM
Citation
 Jiang, LBeattie, DTJacobsen, JRKintz, SObedencio, GPSaito, DStergiades, IVickery, RGLong, DD Discovery of N-substituted-endo-3-(8-aza-bicyclo[3.2.1]oct-3-yl)-phenol and -phenyl carboxamide series of?-opioid receptor antagonists. Bioorg Med Chem Lett 27:2926-2930 (2017)  
Target
Name:
Kappa-type opioid receptor
Synonyms:
Kappa Opioid Receptor OPRK1 Opiate Kappa 1 | mu/kappa opioid receptor
Type:
G Protein-Coupled Receptor (GPCR)
Mol. Mass.:
42744.99
Organism:
Cavia porcellus (domestic guinea pig)
Description:
P41144
Residue:
380
  
Inhibitor
Name:
BDBM50278337
Synonyms:
CHEMBL470617 | Naltrexone methiodide
Type:
Small organic molecule
Emp. Form.:
C21H26NO4
Mol. Mass.:
356.4349
SMILES:
C[N+]1(CC2CC2)CC[C@@]23[C@H]4Oc5c2c(C[C@@H]1[C@]3(O)CCC4=O)ccc5O
: