Target
Basic phospholipase A2 VRV-PL-VIIIa
Ligand
BDBM50243030
Substrate
Meas. Tech.
ChEMBL_1672476 (CHEMBL4022505)
IC50
21330±n/a nM
Citation
 Lokeshwari, DMRekha, NDSrinivasan, BVivek, HKKariyappa, AK Design, synthesis of novel furan appended benzothiazepine derivatives and in vitro biological evaluation as potent VRV-PL-8a and H Bioorg Med Chem Lett 27:3048-3054 (2017)  
Target
Name:
Basic phospholipase A2 VRV-PL-VIIIa
Synonyms:
3.1.1.4 DPLA2 PLA24 Phospholipase A2 4 | svPLA2
Type:
PROTEIN
Mol. Mass.:
13615.14
Organism:
Daboia russelii
Description:
ChEMBL_116772
Residue:
121
  
Inhibitor
Name:
BDBM50243030
Synonyms:
CHEMBL4087976
Type:
Small organic molecule
Emp. Form.:
C20H17NO2S
Mol. Mass.:
335.419
SMILES:
COc1ccc(cc1)C1CC(=Nc2ccccc2S1)c1ccco1
: