Target
Chitotriosidase-1
Ligand
BDBM50243745
Substrate
Meas. Tech.
ChEMBL_1672917 (CHEMBL4022946)
Ki
3404±n/a nM
Citation
 Mazur, MOlczak, JOlejniczak, SKoralewski, RCzestkowski, WJedrzejczak, AGolab, JDzwonek, KDymek, BSklepkiewicz, PLZagozdzon, ANoonan, TMahboubi, KConway, BSheeler, RBeckett, PHungerford, WMPodjarny, AMitschler, ACousido-Siah, AFadel, FGolebiowski, A Targeting Acidic Mammalian chitinase Is Effective in Animal Model of Asthma. J Med Chem 61:695-710 (2018)  
Target
Name:
Chitotriosidase-1
Synonyms:
3.2.1.14 Chit1 Chitotriosidase-1
Type:
PROTEIN
Mol. Mass.:
51108.04
Organism:
Mus musculus
Description:
ChEMBL_117450
Residue:
464
  
Inhibitor
Name:
BDBM50243745
Synonyms:
CHEMBL4076989
Type:
Small organic molecule
Emp. Form.:
C19H29ClN6
Mol. Mass.:
376.927
SMILES:
CC(C)CN(CCc1ccc(Cl)cc1)C1CCN(CC1)c1nc(N)n[nH]1
: