Target
Metabotropic glutamate receptor 3
Ligand
BDBM50244188
Substrate
Meas. Tech.
ChEMBL_1673189 (CHEMBL4023218)
Ki
4.6±n/a nM
Citation
 Monn, JAHenry, SSMassey, SMClawson, DKChen, QDiseroad, BABhardwaj, RMAtwell, SLu, FWang, JRussell, MHeinz, BAWang, XSCarter, JHGetman, BGAdragni, KBroad, LMSanger, HEUrsu, DCatlow, JTSwanson, SJohnson, BGShaw, DBMcKinzie, DLHao, J Synthesis and Pharmacological Characterization of C4 J Med Chem 61:2303-2328 (2018)  
Target
Name:
Metabotropic glutamate receptor 3
Synonyms:
GPRC1C GRM3_HUMAN metabotropic glutamate 3 metabotropic glutamate 3/1c
Type:
Enzyme Catalytic Domain
Mol. Mass.:
98889.09
Organism:
Homo sapiens (Human)
Description:
metabotropic glutamate 1c 0 HUMAN::Q14832
Residue:
879
  
Inhibitor
Name:
BDBM50244188
Synonyms:
CHEMBL4061162
Type:
Small organic molecule
Emp. Form.:
C16H18N2O6
Mol. Mass.:
334.3239
SMILES:
[H][C@]12[C@H](C(O)=O)[C@@]1([H])[C@@](N)(C[C@@H]2NC(=O)c1ccc(OC)cc1)C(O)=O
: