Target
Thromboxane-A synthase
Ligand
BDBM50003795
Substrate
Meas. Tech.
ChEBML_209924
IC50
3±n/a nM
Citation
 Bhagwat, SSGude, CBoswell, CContardo, NCohen, DSDotson, RMathis, JLee, WFurness, PZoganas, H Thromboxane receptor antagonism combined with thromboxane synthase inhibition. 4. 8-[[(4-Chlorophenyl)sulfonyl]amino]-4-(3-(3-pyridinyl) propyl)octanoic acid and analogs. J Med Chem 35:4373-83 (1992)  
Target
Name:
Thromboxane-A synthase
Synonyms:
CYP5 Cytochrome P450 5A1 TBXAS1 TXA synthase TXS Thromboxane A2 Synthase (P450 TxA2) Thromboxane prostanoid Thromboxane-A synthase
Type:
Enzyme
Mol. Mass.:
60524.67
Organism:
Homo sapiens (Human)
Description:
P24557
Residue:
533
  
Inhibitor
Name:
BDBM50003795
Synonyms:
5-[1-Pyridin-3-yl-1-(3-trifluoromethyl-phenyl)-meth-(E)-ylideneaminooxy]-pentanoic acid CHEMBL280728 ridogrel
Type:
Small organic molecule
Emp. Form.:
C18H17F3N2O3
Mol. Mass.:
366.3344
SMILES:
OC(=O)CCCCO\N=C(\c1cccnc1)c1cccc(c1)C(F)(F)F
: