Target
Nucleotide-binding oligomerization domain-containing protein 2
Ligand
BDBM50164885
Substrate
Meas. Tech.
ChEMBL_1674488 (CHEMBL4024517)
EC50
92±n/a nM
Citation
 Gobec, MToma?i?, T?timac, AFrkanec, RTrontelj, JAnderluh, MMlinari?-Ra??an, IJakopin, ? Discovery of Nanomolar Desmuramylpeptide Agonists of the Innate Immune Receptor Nucleotide-Binding Oligomerization Domain-Containing Protein 2 (NOD2) Possessing Immunostimulatory Properties. J Med Chem 61:2707-2724 (2018)  
Target
Name:
Nucleotide-binding oligomerization domain-containing protein 2
Synonyms:
CARD15 IBD1 NOD2 Nucleotide-binding oligomerization domain-containing protein 2 | nucleotide-binding oligomerization domain containing 2
Type:
PROTEIN
Mol. Mass.:
115287.18
Organism:
Homo sapiens (Human)
Description:
ChEMBL_1454053
Residue:
1040
  
Inhibitor
Name:
BDBM50164885
Synonyms:
CHEBI:59414 | muramyldipeptide
Type:
Small organic molecule
Emp. Form.:
C19H32N4O11
Mol. Mass.:
492.4776
SMILES:
C[C@H](NC(=O)[C@@H](C)O[C@H]1[C@H](O)[C@@H](CO)O[C@@H](O)[C@@H]1NC(C)=O)C(=O)N[C@H](CCC(O)=O)C(N)=O
: