Target
14-3-3 protein zeta/delta
Ligand
BDBM50246081
Substrate
Meas. Tech.
ChEMBL_1676464 (CHEMBL4026607)
Kd
>20000±n/a nM
Citation
 Krüger, DMGlas, ABier, DPospiech, NWallraven, KDietrich, LOttmann, CKoch, OHennig, SGrossmann, TN Structure-Based Design of Non-natural Macrocyclic Peptides That Inhibit Protein-Protein Interactions. J Med Chem 60:8982-8988 (2017)  
Target
Name:
14-3-3 protein zeta/delta
Synonyms:
14-3-3 protein zeta/delta KCIP-1 YWHAZ
Type:
PROTEIN
Mol. Mass.:
27731.18
Organism:
Homo sapiens
Description:
ChEMBL_117504
Residue:
245
  
Inhibitor
Name:
BDBM50246081
Synonyms:
CHEMBL4100127
Type:
Small organic molecule
Emp. Form.:
C97H131N15O25S
Mol. Mass.:
1939.229
SMILES:
CC(C)C[C@H](NC(=O)[C@H](CC(O)=O)NC(=O)[C@H](CC(C)C)NC(=O)[C@]1(C)CCCCCCCCCCCC[C@](C)(NC(=O)[C@@H](Cc2ccc(cc2)-c2ccccc2)NC(=O)[C@H](CCC(N)=O)NC(=O)COCCOCCNC(=S)Nc2ccc3c(c2)C(=O)OC32c3ccc(O)cc3Oc3cc(O)ccc23)C(=O)N[C@@H](CC(C)C)C(=O)N[C@@H](CC(O)=O)C(=O)N1)C(=O)N[C@@H](C)C(=O)N[C@@H](CO)C(N)=O
: