Target
14-3-3 protein zeta/delta
Ligand
BDBM50246102
Substrate
Meas. Tech.
ChEMBL_1676465 (CHEMBL4026608)
IC50
830±n/a nM
Citation
 Krüger, DMGlas, ABier, DPospiech, NWallraven, KDietrich, LOttmann, CKoch, OHennig, SGrossmann, TN Structure-Based Design of Non-natural Macrocyclic Peptides That Inhibit Protein-Protein Interactions. J Med Chem 60:8982-8988 (2017)  
Target
Name:
14-3-3 protein zeta/delta
Synonyms:
14-3-3 protein zeta/delta KCIP-1 YWHAZ
Type:
PROTEIN
Mol. Mass.:
27731.18
Organism:
Homo sapiens
Description:
ChEMBL_117504
Residue:
245
  
Inhibitor
Name:
BDBM50246102
Synonyms:
CHEMBL4096939
Type:
Small organic molecule
Emp. Form.:
C68H109N13O21
Mol. Mass.:
1444.6676
SMILES:
CC(C)C[C@H](NC(=O)[C@H](CC(O)=O)NC(=O)[C@H](CC(C)C)NC(=O)[C@]1(C)CCCCCCCCCCCC[C@](C)(NC(=O)CNC(=O)[C@H](CCC(N)=O)NC(C)=O)C(=O)N[C@H](C(=O)N[C@@H](CC(O)=O)C(=O)N1)C12CC3CC(CC(C3)C1)C2)C(=O)N[C@@H](C)C(=O)N[C@@H](CC(C(O)=O)C(O)=O)C(N)=O
: