Target
5'-AMP-activated protein kinase subunit gamma-1
Ligand
BDBM50246120
Substrate
Meas. Tech.
ChEMBL_1676499 (CHEMBL4026642)
EC50
39±n/a nM
Citation
 Lan, PRomero, FAWodka, DKassick, AJDang, QGibson, TCashion, DZhou, GChen, YZhang, XZhang, ALi, YTrujillo, MEShao, QWu, MXu, SHe, HMacKenna, DStaunton, JChapman, KTWeber, ASebhat, IKMakara, GM Hit-to-Lead Optimization and Discovery of 5-((5-([1,1'-Biphenyl]-4-yl)-6-chloro-1H-benzo[d]imidazol-2-yl)oxy)-2-methylbenzoic Acid (MK-3903): A Novel Class of Benzimidazole-Based Activators of AMP-Activated Protein Kinase. J Med Chem 60:9040-9052 (2017)  
Target
Name:
5'-AMP-activated protein kinase subunit gamma-1
Synonyms:
5'-AMP-activated protein kinase subunit gamma-1 AMP-activated protein kinase, gamma-1 subunit AMPK gamma-1 AMPK subunit gamma-1 PRKAG1
Type:
Mol. Mass.:
37581.44
Organism:
Homo sapiens (Human)
Description:
P54619
Residue:
331
  
Inhibitor
Name:
BDBM50246120
Synonyms:
CHEMBL4082745
Type:
Small organic molecule
Emp. Form.:
C27H19ClN2O3
Mol. Mass.:
454.904
SMILES:
Cc1ccc(Oc2nc3cc(c(Cl)cc3[nH]2)-c2ccc(cc2)-c2ccccc2)cc1C(O)=O
: