Target
Renin
Ligand
BDBM50004412
Substrate
Meas. Tech.
ChEBML_195957
IC50
288±n/a nM
Citation
 Ashton, WTCantone, CLTolman, RLGreenlee, WJLynch, RJSchorn, TWStrouse, JFSiegl, PK Inhibitors of human renin with C-termini derived from amides and esters of alpha-mercaptoalkanoic acids. J Med Chem 35:2772-81 (1992)  
Target
Name:
Renin
Synonyms:
Angiotensinogenase RENI_HUMAN
Type:
Enzyme
Mol. Mass.:
45058.99
Organism:
Homo sapiens (Human)
Description:
Residue:
406
  
Inhibitor
Name:
BDBM50004412
Synonyms:
2-{3-[2-(2-tert-Butoxycarbonylamino-3-phenyl-propionylamino)-3-(1H-imidazol-4-yl)-propionylamino]-4-cyclohexyl-2-hydroxy-butylsulfanyl}-4-methyl-pentanoic acid ethyl ester | CHEMBL96743
Type:
Small organic molecule
Emp. Form.:
C38H59N5O7S
Mol. Mass.:
729.969
SMILES:
CCOC(=O)[C@H](CC(C)C)SC[C@H](O)[C@H](CC1CCCCC1)NC(=O)[C@H](Cc1cnc[nH]1)NC(=O)[C@H](Cc1ccccc1)NC(=O)OC(C)(C)C
: