Target
Steroid 21-hydroxylase
Ligand
BDBM50004442
Substrate
Meas. Tech.
ChEBML_158901
IC50
4460±n/a nM
Citation
 Rotstein, DMKertesz, DJWalker, KASwinney, DC Stereoisomers of ketoconazole: preparation and biological activity. J Med Chem 35:2818-25 (1992)  
Target
Name:
Steroid 21-hydroxylase
Synonyms:
CP21A_HUMAN CYP21A2 Cytochrome P450 21 | Cytochrome P450 21A2
Type:
PROTEIN
Mol. Mass.:
55896.25
Organism:
Homo sapiens (Human)
Description:
ChEMBL_1498865
Residue:
494
  
Inhibitor
Name:
BDBM50004442
Synonyms:
(2S,4S)-ketoconazole CHEMBL319160 | CIS-1-ACETYL-4-(4-((2-(2,4-DICHLOROPHENYL)-2-(1H-IMIDAZOL-1-YLMETHYL)-1,3-DIOXOLAN-4-YL)METHOXY)PHENYL)PIPERAZINE
Type:
Small organic molecule
Emp. Form.:
C26H28Cl2N4O4
Mol. Mass.:
531.431
SMILES:
CC(=O)N1CCN(CC1)c1ccc(OC[C@H]2CO[C@](Cn3ccnc3)(O2)c2ccc(Cl)cc2Cl)cc1
: