Target
Lanosterol 14-alpha demethylase
Ligand
BDBM50004442
Substrate
Meas. Tech.
ChEBML_52075
IC50
1600±n/a nM
Citation
 Rotstein, DMKertesz, DJWalker, KASwinney, DC Stereoisomers of ketoconazole: preparation and biological activity. J Med Chem 35:2818-25 (1992)  
Target
Name:
Lanosterol 14-alpha demethylase
Synonyms:
CP51A_RAT Cyp51 Cytochrome P450 51 LDM P450-14DM P450LI | Sterol 14-alpha demethylase
Type:
PROTEIN
Mol. Mass.:
56717.47
Organism:
Rattus norvegicus
Description:
ChEMBL_52075
Residue:
503
  
Inhibitor
Name:
BDBM50004442
Synonyms:
(2S,4S)-ketoconazole CHEMBL319160 | CIS-1-ACETYL-4-(4-((2-(2,4-DICHLOROPHENYL)-2-(1H-IMIDAZOL-1-YLMETHYL)-1,3-DIOXOLAN-4-YL)METHOXY)PHENYL)PIPERAZINE
Type:
Small organic molecule
Emp. Form.:
C26H28Cl2N4O4
Mol. Mass.:
531.431
SMILES:
CC(=O)N1CCN(CC1)c1ccc(OC[C@H]2CO[C@](Cn3ccnc3)(O2)c2ccc(Cl)cc2Cl)cc1
: