Target
Cytochrome P450 7A1
Ligand
BDBM31768
Substrate
Meas. Tech.
ChEMBL_48771 (CHEMBL663246)
IC50
2400±n/a nM
Citation
 Rotstein, DMKertesz, DJWalker, KASwinney, DC Stereoisomers of ketoconazole: preparation and biological activity. J Med Chem 35:2818-25 (1992)  
Target
Name:
Cytochrome P450 7A1
Synonyms:
CP7A1_RAT Cyp7a1
Type:
PROTEIN
Mol. Mass.:
56896.90
Organism:
Rattus norvegicus
Description:
ChEMBL_48771
Residue:
503
  
Inhibitor
Name:
BDBM31768
Synonyms:
CHEMBL295698 Nizoral | Panfungol
Type:
Small organic molecule
Emp. Form.:
C26H28Cl2N4O4
Mol. Mass.:
531.431
SMILES:
CC(=O)N1CCN(CC1)c1ccc(OC[C@@H]2CO[C@](Cn3ccnc3)(O2)c2ccc(Cl)cc2Cl)cc1
: