Target
Potassium voltage-gated channel subfamily H member 2
Ligand
BDBM50246760
Substrate
Meas. Tech.
ChEMBL_1676811 (CHEMBL4026954)
EC50
>33000±n/a nM
Citation
 Van der Plas, SEKelgtermans, HDe Munck, TMartina, SLXDropsit, SQuinton, EDe Blieck, AJoannesse, CTomaskovic, LJans, MChristophe, Tvan der Aar, EBorgonovi, MNelles, LGees, MStouten, PVan Der Schueren, JMammoliti, OConrath, KAndrews, M Discovery of N-(3-Carbamoyl-5,5,7,7-tetramethyl-5,7-dihydro-4H-thieno[2,3-c]pyran-2-yl)-lH-pyrazole-5-carboxamide (GLPG1837), a Novel Potentiator Which Can Open Class III Mutant Cystic Fibrosis Transmembrane Conductance Regulator (CFTR) Channels to a High Extent. J Med Chem 61:1425-1435 (2018)  
Target
Name:
Potassium voltage-gated channel subfamily H member 2
Synonyms:
1,3-beta-glucan synthase component GLS2 ERG Eag-related protein 1 Ether-a-go-go-related gene (HERG) Ether-a-go-go-related gene potassium channel 1 Ether-a-go-go-related gene potassium channel 1 (hERG1) Ether-a-go-go-related protein 1 H-ERG KCNH2 Potassium voltage-gated channel subfamily H member 2 (hERG) Voltage-gated potassium channel subunit Kv11.1 hERG Potassium Channel 1 | putative potassium channel subunit
Type:
Multi-pass membrane protein
Mol. Mass.:
126672.65
Organism:
Homo sapiens (Human)
Description:
Q12809
Residue:
1159
  
Inhibitor
Name:
BDBM50246760
Synonyms:
CHEMBL4075348
Type:
Small organic molecule
Emp. Form.:
C16H20N4O3S
Mol. Mass.:
348.42
SMILES:
CC1(C)Cc2c(sc(NC(=O)c3ccn[nH]3)c2C(N)=O)C(C)(C)O1
: