Target
Cytochrome P450 2B6
Ligand
BDBM85509
Substrate
Meas. Tech.
ChEMBL_1677529 (CHEMBL4027672)
IC50
70000±n/a nM
Citation
 Li, BNi, SMao, FChen, FLiu, YWei, HChen, WZhu, JLan, LLi, J Novel Terminal Bipheny-Based Diapophytoene Desaturases (CrtN) Inhibitors as Anti-MRSA/VISR/LRSA Agents with Reduced hERG Activity. J Med Chem 61:224-250 (2018)  
Target
Name:
Cytochrome P450 2B6
Synonyms:
CP2B6_HUMAN Cytochrome P450 2B6 (CYP2B6)
Type:
Protein
Mol. Mass.:
56289.75
Organism:
Homo sapiens (Human)
Description:
P20813
Residue:
491
  
Inhibitor
Name:
BDBM85509
Synonyms:
CAS_55142-85-3 Ticlopidine
Type:
Small organic molecule
Emp. Form.:
C14H14ClNS
Mol. Mass.:
263.786
SMILES:
Clc1ccccc1CN1CCc2sccc2C1
: