Target
4,4'-diapophytoene desaturase (4,4'-diaponeurosporene-forming)
Ligand
BDBM50247169
Substrate
Meas. Tech.
ChEMBL_1677512 (CHEMBL4027655)
IC50
8.0±n/a nM
Citation
 Li, BNi, SMao, FChen, FLiu, YWei, HChen, WZhu, JLan, LLi, J Novel Terminal Bipheny-Based Diapophytoene Desaturases (CrtN) Inhibitors as Anti-MRSA/VISR/LRSA Agents with Reduced hERG Activity. J Med Chem 61:224-250 (2018)  
Target
Name:
4,4'-diapophytoene desaturase (4,4'-diaponeurosporene-forming)
Synonyms:
1.3.8.- Dehydrosqualene desaturase | crtN
Type:
PROTEIN
Mol. Mass.:
56702.79
Organism:
Staphylococcus aureus (strain MW2)
Description:
ChEMBL_116914
Residue:
502
  
Inhibitor
Name:
BDBM50247169
Synonyms:
CHEMBL4101749
Type:
Small organic molecule
Emp. Form.:
C25H25ClN2
Mol. Mass.:
388.932
SMILES:
Cl.CN(C\C=C\c1ccc(cc1)-c1ccccc1)Cc1cccc2cc[nH]c12
: