Target
Bile salt export pump
Ligand
BDBM25762
Substrate
Meas. Tech.
ChEMBL_1678644 (CHEMBL4028921)
IC50
>133000±n/a nM
Citation
 Morgan, REvan Staden, CJChen, YKalyanaraman, NKalanzi, JDunn, RTAfshari, CAHamadeh, HK A multifactorial approach to hepatobiliary transporter assessment enables improved therapeutic compound development. Toxicol Sci 136:216-41 (2013)  
Target
Name:
Bile salt export pump
Synonyms:
ABCB11 ATP-binding cassette sub-family B member 11 Bile Salt Export Pump, BSEP Bile salt export pump (BSEP)
Type:
Protein
Mol. Mass.:
146405.49
Organism:
Homo sapiens (Human)
Description:
O95342
Residue:
1321
  
Inhibitor
Name:
BDBM25762
Synonyms:
CHEMBL471 SOTALOL HYDROCHLORIDE Sotalol,(+) cid_66245
Type:
Small organic molecule
Emp. Form.:
C12H20N2O3S
Mol. Mass.:
272.364
SMILES:
CC(C)NCC(O)c1ccc(NS(C)(=O)=O)cc1
: