Target
ATP-binding cassette sub-family C member 4
Ligand
BDBM50101963
Substrate
Meas. Tech.
ChEMBL_1678647 (CHEMBL4028924)
IC50
16500±n/a nM
Citation
 Morgan, REvan Staden, CJChen, YKalyanaraman, NKalanzi, JDunn, RTAfshari, CAHamadeh, HK A multifactorial approach to hepatobiliary transporter assessment enables improved therapeutic compound development. Toxicol Sci 136:216-41 (2013)  
Target
Name:
ATP-binding cassette sub-family C member 4
Synonyms:
ABCC4 MOAT-B MRP/cMOAT-related ABC transporter MRP4_HUMAN Multidrug resistance-associated protein 4
Type:
PROTEIN
Mol. Mass.:
149546.12
Organism:
Homo sapiens (Human)
Description:
ChEMBL_1486828
Residue:
1325
  
Inhibitor
Name:
BDBM50101963
Synonyms:
BAY-K-5552 Nisoldipine | Sular
Type:
Small organic molecule
Emp. Form.:
C20H24N2O6
Mol. Mass.:
388.4144
SMILES:
COC(=O)C1=C(C)NC(C)=C(C1c1ccccc1[N+]([O-])=O)C(=O)OCC(C)C
: