Target
Bile salt export pump
Ligand
BDBM50344965
Substrate
Meas. Tech.
ChEMBL_1678644 (CHEMBL4028921)
IC50
>133000±n/a nM
Citation
 Morgan, REvan Staden, CJChen, YKalyanaraman, NKalanzi, JDunn, RTAfshari, CAHamadeh, HK A multifactorial approach to hepatobiliary transporter assessment enables improved therapeutic compound development. Toxicol Sci 136:216-41 (2013)  
Target
Name:
Bile salt export pump
Synonyms:
ABCB11 ATP-binding cassette sub-family B member 11 Bile Salt Export Pump, BSEP Bile salt export pump (BSEP)
Type:
Protein
Mol. Mass.:
146405.49
Organism:
Homo sapiens (Human)
Description:
O95342
Residue:
1321
  
Inhibitor
Name:
BDBM50344965
Synonyms:
1-(4-chlorophenylsulfonyl)-3-propylurea 4-chloro-N-[(propylamino)carbonyl]benzenesulfonamide CHLORPROPAMIDE Glucamide
Type:
Small organic molecule
Emp. Form.:
C10H13ClN2O3S
Mol. Mass.:
276.74
SMILES:
CCCNC(=O)NS(=O)(=O)c1ccc(Cl)cc1
: