Target
ATP-binding cassette sub-family C member 3
Ligand
BDBM50045000
Substrate
Meas. Tech.
ChEMBL_1678646 (CHEMBL4028923)
IC50
>133000±n/a nM
Citation
 Morgan, REvan Staden, CJChen, YKalyanaraman, NKalanzi, JDunn, RTAfshari, CAHamadeh, HK A multifactorial approach to hepatobiliary transporter assessment enables improved therapeutic compound development. Toxicol Sci 136:216-41 (2013)  
Target
Name:
ATP-binding cassette sub-family C member 3
Synonyms:
ABCC3 CMOAT2 MLP2 MRP3 Multi-specific organic anion transporter D | Multidrug resistance-associated protein 3
Type:
PROTEIN
Mol. Mass.:
169352.45
Organism:
Homo sapiens (Human)
Description:
ChEMBL_735421
Residue:
1527
  
Inhibitor
Name:
BDBM50045000
Synonyms:
(NFLX)1-Ethyl-6-fluoro-4-oxo-7-piperazin-1-yl-1,4-dihydro-quinoline-3-carboxylic acid 1-Ethyl-6-fluoro-4-oxo-7-piperazin-1-yl-1,4,4a,8a-tetrahydro-quinoline-3-carboxylic acid (norfloxacin) 1-Ethyl-6-fluoro-4-oxo-7-piperazin-1-yl-1,4-dihydro-quinoline-3-carboxylic acid (Norfloxacin) 1-Ethyl-6-fluoro-4-oxo-7-piperazin-1-yl-1,4-dihydro-quinoline-3-carboxylic acid(Norfloxacin) 1-ethyl-6-fluoro-7-hexahydro-1-pyrazinyl-4-oxo-1,4-dihydro-3-quinolinecarboxylic acid Chibroxin NORFLOXACIN | Noroxin
Type:
Small organic molecule
Emp. Form.:
C16H18FN3O3
Mol. Mass.:
319.3308
SMILES:
CCn1cc(C(O)=O)c(=O)c2cc(F)c(cc12)N1CCNCC1
: