Target
ATP-binding cassette sub-family C member 4
Ligand
BDBM50003677
Substrate
Meas. Tech.
ChEMBL_1678647 (CHEMBL4028924)
IC50
>133000±n/a nM
Citation
 Morgan, REvan Staden, CJChen, YKalyanaraman, NKalanzi, JDunn, RTAfshari, CAHamadeh, HK A multifactorial approach to hepatobiliary transporter assessment enables improved therapeutic compound development. Toxicol Sci 136:216-41 (2013)  
Target
Name:
ATP-binding cassette sub-family C member 4
Synonyms:
ABCC4 MOAT-B MRP/cMOAT-related ABC transporter MRP4_HUMAN Multidrug resistance-associated protein 4
Type:
PROTEIN
Mol. Mass.:
149546.12
Organism:
Homo sapiens (Human)
Description:
ChEMBL_1486828
Residue:
1325
  
Inhibitor
Name:
BDBM50003677
Synonyms:
4-(p-bis(beta-chloroethyl)aminophenyl)butyric acid 4-{4-[bis(2-chloroethyl)amino]phenyl}butanoic acid CHEMBL515 Leukeran chloraminophen phenylbutyric acid nitrogen mustard
Type:
Small organic molecule
Emp. Form.:
C14H19Cl2NO2
Mol. Mass.:
304.212
SMILES:
OC(=O)CCCc1ccc(cc1)N(CCCl)CCCl
: