Target
ATP-binding cassette sub-family C member 2
Ligand
BDBM50017666
Substrate
Meas. Tech.
ChEMBL_1678645 (CHEMBL4028922)
IC50
>133000±n/a nM
Citation
 Morgan, REvan Staden, CJChen, YKalyanaraman, NKalanzi, JDunn, RTAfshari, CAHamadeh, HK A multifactorial approach to hepatobiliary transporter assessment enables improved therapeutic compound development. Toxicol Sci 136:216-41 (2013)  
Target
Name:
ATP-binding cassette sub-family C member 2
Synonyms:
ABCC2 CMOAT CMRP Canalicular multispecific organic anion transporter 1 MRP2 Multidrug resistance-associated protein 2 Multidrug resistance-associated protein 3 (MRP3)
Type:
Protein
Mol. Mass.:
174229.45
Organism:
Homo sapiens (Human)
Description:
Q92887
Residue:
1545
  
Inhibitor
Name:
BDBM50017666
Synonyms:
1-(p-bromophenyl)-1-(2-pyridyl)-3-dimethylaminopropane 3-(4-bromophenyl)-N,N-dimethyl-3-(2-pyridinyl)-1-propanamine 3-(p-bromophenyl)-3-(2-pyridyl)-N,N-dimethylpropylamine CHEMBL811
Type:
Small organic molecule
Emp. Form.:
C16H19BrN2
Mol. Mass.:
319.239
SMILES:
CN(C)CCC(c1ccc(Br)cc1)c1ccccn1
: