Target
ATP-binding cassette sub-family C member 4
Ligand
BDBM50181473
Substrate
Meas. Tech.
ChEMBL_1678647 (CHEMBL4028924)
IC50
>133000±n/a nM
Citation
 Morgan, REvan Staden, CJChen, YKalyanaraman, NKalanzi, JDunn, RTAfshari, CAHamadeh, HK A multifactorial approach to hepatobiliary transporter assessment enables improved therapeutic compound development. Toxicol Sci 136:216-41 (2013)  
Target
Name:
ATP-binding cassette sub-family C member 4
Synonyms:
ABCC4 MOAT-B MRP/cMOAT-related ABC transporter MRP4_HUMAN Multidrug resistance-associated protein 4
Type:
PROTEIN
Mol. Mass.:
149546.12
Organism:
Homo sapiens (Human)
Description:
ChEMBL_1486828
Residue:
1325
  
Inhibitor
Name:
BDBM50181473
Synonyms:
4-(4-(4-(4-(((3R,5R)-5-((1H-1,2,4-triazol-1-yl)methyl)-5-(2,4-difluorophenyl)-tetrahydrofuran-3-yl)methoxy)phenyl)piperazin-1-yl)phenyl)-2-((2S,3S)-2-hydroxypentan-3-yl)-2H-1,2,4-triazol-3(4H)-one 4-[4-(4-{4-[(R)-5-(2,4-difluoro-phenyl)-5-(4,5-dihydro-[1,2,4]triazol-1-ylmethyl)-tetrahydro-furan-3-ylmethoxy]-phenyl}-piperazin-1-yl)-phenyl]-2-((1S,2S)-1-ethyl-2-hydroxy-propyl)-2,4-dihydro-[1,2,4]triazol-3-one Noxafil pasaconazole
Type:
Small organic molecule
Emp. Form.:
C37H42F2N8O4
Mol. Mass.:
700.7774
SMILES:
CC[C@@H]([C@H](C)O)n1ncn(-c2ccc(cc2)N2CCN(CC2)c2ccc(OC[C@@H]3CO[C@](Cn4cncn4)(C3)c3ccc(F)cc3F)cc2)c1=O
: