Target
ATP-binding cassette sub-family C member 4
Ligand
BDBM58924
Substrate
Meas. Tech.
ChEMBL_1678647 (CHEMBL4028924)
IC50
>133000±n/a nM
Citation
 Morgan, REvan Staden, CJChen, YKalyanaraman, NKalanzi, JDunn, RTAfshari, CAHamadeh, HK A multifactorial approach to hepatobiliary transporter assessment enables improved therapeutic compound development. Toxicol Sci 136:216-41 (2013)  
Target
Name:
ATP-binding cassette sub-family C member 4
Synonyms:
ABCC4 MOAT-B MRP/cMOAT-related ABC transporter MRP4_HUMAN Multidrug resistance-associated protein 4
Type:
PROTEIN
Mol. Mass.:
149546.12
Organism:
Homo sapiens (Human)
Description:
ChEMBL_1486828
Residue:
1325
  
Inhibitor
Name:
BDBM58924
Synonyms:
(2Z)-2-[(3R,4S,5S,8S,9S,10S,11R,13R,14S,16S)-16-acetoxy-3,11-dihydroxy-4,8,10,14-tetramethyl-2,3,4,5,6,7,9,11,12,13,15,16-dodecahydro-1H-cyclopenta[a]phenanthren-17-ylidene]-6-methyl-hept-5-enoic acid (2Z)-2-[(3R,4S,5S,8S,9S,10S,11R,13R,14S,16S)-16-acetyloxy-3,11-dihydroxy-4,8,10,14-tetramethyl-2,3,4,5,6,7,9,11,12,13,15,16-dodecahydro-1H-cyclopenta[a]phenanthren-17-ylidene]-6-methylhept-5-enoic acid Fusidic acid SMR000857101 | cid_3000226
Type:
Small organic molecule
Emp. Form.:
C31H48O6
Mol. Mass.:
516.7092
SMILES:
[#6]-[#6@@H]-1-[#6@H](-[#8])-[#6]-[#6][C@@]2([#6])[#6@H]-1-[#6]-[#6][C@@]1([#6])[#6@H]2-[#6@H](-[#8])-[#6]-[#6@H]2\[#6](-[#6@H](-[#6][C@]12[#6])-[#8]-[#6](-[#6])=O)=[#6](/[#6]-[#6]\[#6]=[#6](\[#6])-[#6])-[#6](-[#8])=O
: