Target
ATP-binding cassette sub-family C member 4
Ligand
BDBM50002861
Substrate
Meas. Tech.
ChEMBL_1678647 (CHEMBL4028924)
IC50
12000±n/a nM
Citation
 Morgan, REvan Staden, CJChen, YKalyanaraman, NKalanzi, JDunn, RTAfshari, CAHamadeh, HK A multifactorial approach to hepatobiliary transporter assessment enables improved therapeutic compound development. Toxicol Sci 136:216-41 (2013)  
Target
Name:
ATP-binding cassette sub-family C member 4
Synonyms:
ABCC4 MOAT-B MRP/cMOAT-related ABC transporter MRP4_HUMAN Multidrug resistance-associated protein 4
Type:
PROTEIN
Mol. Mass.:
149546.12
Organism:
Homo sapiens (Human)
Description:
ChEMBL_1486828
Residue:
1325
  
Inhibitor
Name:
BDBM50002861
Synonyms:
3-(4,5-Diphenyl-oxazol-2-yl)-propionic acid Daypro WY-21743 | oxaprosin
Type:
Small organic molecule
Emp. Form.:
C18H15NO3
Mol. Mass.:
293.3166
SMILES:
OC(=O)CCc1nc(c(o1)-c1ccccc1)-c1ccccc1
: