Target
ATP-binding cassette sub-family C member 3
Ligand
BDBM50103596
Substrate
Meas. Tech.
ChEMBL_1678646 (CHEMBL4028923)
IC50
14600±n/a nM
Citation
 Morgan, REvan Staden, CJChen, YKalyanaraman, NKalanzi, JDunn, RTAfshari, CAHamadeh, HK A multifactorial approach to hepatobiliary transporter assessment enables improved therapeutic compound development. Toxicol Sci 136:216-41 (2013)  
Target
Name:
ATP-binding cassette sub-family C member 3
Synonyms:
ABCC3 CMOAT2 MLP2 MRP3 Multi-specific organic anion transporter D | Multidrug resistance-associated protein 3
Type:
PROTEIN
Mol. Mass.:
169352.45
Organism:
Homo sapiens (Human)
Description:
ChEMBL_735421
Residue:
1527
  
Inhibitor
Name:
BDBM50103596
Synonyms:
(E)-2-hydroxy-5-((4-(N-pyridin-2-ylsulfamoyl)-phenyl)diazenyl) benzoic acid (A8) Azulfidine EN CHEBI:9334 S.A.S.-500 Salazopyrin Salicylazosulfapyridine Sulphasalazine | US11744839, Compound of formula 1
Type:
Small organic molecule
Emp. Form.:
C18H14N4O5S
Mol. Mass.:
398.393
SMILES:
OC(=O)c1cc(ccc1O)\N=N\c1ccc(cc1)S(=O)(=O)Nc1ccccn1
: