Target
Bile salt export pump
Ligand
BDBM25770
Substrate
Meas. Tech.
ChEMBL_1678644 (CHEMBL4028921)
IC50
>133000±n/a nM
Citation
 Morgan, REvan Staden, CJChen, YKalyanaraman, NKalanzi, JDunn, RTAfshari, CAHamadeh, HK A multifactorial approach to hepatobiliary transporter assessment enables improved therapeutic compound development. Toxicol Sci 136:216-41 (2013)  
Target
Name:
Bile salt export pump
Synonyms:
ABCB11 ATP-binding cassette sub-family B member 11 Bile Salt Export Pump, BSEP Bile salt export pump (BSEP)
Type:
Protein
Mol. Mass.:
146405.49
Organism:
Homo sapiens (Human)
Description:
O95342
Residue:
1321
  
Inhibitor
Name:
BDBM25770
Synonyms:
5-[2-(tert-butylamino)-1-hydroxyethyl]benzene-1,3-diol Brethaire Bricanyl Terbutaline,(+/-)
Type:
Small organic molecule
Emp. Form.:
C12H19NO3
Mol. Mass.:
225.2842
SMILES:
CC(C)(C)NCC(O)c1cc(O)cc(O)c1
: