Target
ATP-binding cassette sub-family C member 2
Ligand
BDBM50022775
Substrate
Meas. Tech.
ChEMBL_1678645 (CHEMBL4028922)
IC50
>133000±n/a nM
Citation
 Morgan, REvan Staden, CJChen, YKalyanaraman, NKalanzi, JDunn, RTAfshari, CAHamadeh, HK A multifactorial approach to hepatobiliary transporter assessment enables improved therapeutic compound development. Toxicol Sci 136:216-41 (2013)  
Target
Name:
ATP-binding cassette sub-family C member 2
Synonyms:
ABCC2 CMOAT CMRP Canalicular multispecific organic anion transporter 1 MRP2 Multidrug resistance-associated protein 2 Multidrug resistance-associated protein 3 (MRP3)
Type:
Protein
Mol. Mass.:
174229.45
Organism:
Homo sapiens (Human)
Description:
Q92887
Residue:
1545
  
Inhibitor
Name:
BDBM50022775
Synonyms:
(m-Hydroxyphenyl)trimethylammonium dimethylcarbamate 3-[(dimethylcarbamoyl)oxy]-N,N,N-trimethylanilinium CHEMBL278020 Eustigmine Neostigmine (2) Vagostigmine | m-Trimethylammoniumphenyldimethylcarbamate
Type:
Small organic molecule
Emp. Form.:
C12H19N2O2
Mol. Mass.:
223.2909
SMILES:
CN(C)C(=O)Oc1cccc(c1)[N+](C)(C)C
: