Target
ATP-binding cassette sub-family C member 2
Ligand
BDBM60917
Substrate
Meas. Tech.
ChEMBL_1678645 (CHEMBL4028922)
IC50
>133000±n/a nM
Citation
 Morgan, REvan Staden, CJChen, YKalyanaraman, NKalanzi, JDunn, RTAfshari, CAHamadeh, HK A multifactorial approach to hepatobiliary transporter assessment enables improved therapeutic compound development. Toxicol Sci 136:216-41 (2013)  
Target
Name:
ATP-binding cassette sub-family C member 2
Synonyms:
ABCC2 CMOAT CMRP Canalicular multispecific organic anion transporter 1 MRP2 Multidrug resistance-associated protein 2 Multidrug resistance-associated protein 3 (MRP3)
Type:
Protein
Mol. Mass.:
174229.45
Organism:
Homo sapiens (Human)
Description:
Q92887
Residue:
1545
  
Inhibitor
Name:
BDBM60917
Synonyms:
9-chloranyl-5-(4-hydroxyphenyl)-2,3,4,5-tetrahydro-1H-3-benzazepine-7,8-diol;methanesulfonic acid 9-chloro-5-(4-hydroxyphenyl)-2,3,4,5-tetrahydro-1H-3-benzazepine-7,8-diol;methanesulfonic acid FENOLDOPAM MESYLATE SMR000469190 | cid_49659
Type:
Small organic molecule
Emp. Form.:
C16H16ClNO3
Mol. Mass.:
305.756
SMILES:
Oc1ccc(cc1)C1CNCCc2c(Cl)c(O)c(O)cc12
: