Target
ATP-binding cassette sub-family C member 2
Ligand
BDBM50128548
Substrate
Meas. Tech.
ChEMBL_1678645 (CHEMBL4028922)
IC50
>133000±n/a nM
Citation
 Morgan, REvan Staden, CJChen, YKalyanaraman, NKalanzi, JDunn, RTAfshari, CAHamadeh, HK A multifactorial approach to hepatobiliary transporter assessment enables improved therapeutic compound development. Toxicol Sci 136:216-41 (2013)  
Target
Name:
ATP-binding cassette sub-family C member 2
Synonyms:
ABCC2 CMOAT CMRP Canalicular multispecific organic anion transporter 1 MRP2 Multidrug resistance-associated protein 2 Multidrug resistance-associated protein 3 (MRP3)
Type:
Protein
Mol. Mass.:
174229.45
Organism:
Homo sapiens (Human)
Description:
Q92887
Residue:
1545
  
Inhibitor
Name:
BDBM50128548
Synonyms:
1-(1-Biphenyl-4-yl-2-phenyl-methyl)-1H-imidazole 1-(Biphenyl-4-yl-phenyl-methyl)-1H-imidazole( Bifanozole) 1-(biphenyl-4-yl-phenyl-methyl)-1H-imidazole CHEMBL277535 cid_2378
Type:
Small organic molecule
Emp. Form.:
C22H18N2
Mol. Mass.:
310.3917
SMILES:
c1cn(cn1)C(c1ccccc1)c1ccc(cc1)-c1ccccc1
: