Target
ATP-binding cassette sub-family C member 4
Ligand
BDBM50023198
Substrate
Meas. Tech.
ChEMBL_1678647 (CHEMBL4028924)
IC50
2700±n/a nM
Citation
 Morgan, REvan Staden, CJChen, YKalyanaraman, NKalanzi, JDunn, RTAfshari, CAHamadeh, HK A multifactorial approach to hepatobiliary transporter assessment enables improved therapeutic compound development. Toxicol Sci 136:216-41 (2013)  
Target
Name:
ATP-binding cassette sub-family C member 4
Synonyms:
ABCC4 MOAT-B MRP/cMOAT-related ABC transporter MRP4_HUMAN Multidrug resistance-associated protein 4
Type:
PROTEIN
Mol. Mass.:
149546.12
Organism:
Homo sapiens (Human)
Description:
ChEMBL_1486828
Residue:
1325
  
Inhibitor
Name:
BDBM50023198
Synonyms:
8-[4-(4-phenylbutyloxy)benzoyl]amino-2-(tetrazol-5-yl)-4-oxo-4H-1-benzopyran N-(4-oxo-2-(1H-tetrazol-5-yl)-4H-chromen-8-yl)-4-(4-phenylbutoxy)benzamide N-[4-Oxo-2-(1H-tetrazol-5-yl)-4H-chromen-8-yl]-4-(4-phenyl-butoxy)-benzamide (ONO-RS-411) ONO-1078 | PRANLUKAST
Type:
Small organic molecule
Emp. Form.:
C27H23N5O4
Mol. Mass.:
481.5026
SMILES:
O=C(Nc1cccc2c1oc(cc2=O)-c1nnn[nH]1)c1ccc(OCCCCc2ccccc2)cc1
: