Target
ATP-binding cassette sub-family C member 4
Ligand
BDBM50406795
Substrate
Meas. Tech.
ChEMBL_1678647 (CHEMBL4028924)
IC50
34100±n/a nM
Citation
 Morgan, REvan Staden, CJChen, YKalyanaraman, NKalanzi, JDunn, RTAfshari, CAHamadeh, HK A multifactorial approach to hepatobiliary transporter assessment enables improved therapeutic compound development. Toxicol Sci 136:216-41 (2013)  
Target
Name:
ATP-binding cassette sub-family C member 4
Synonyms:
ABCC4 MOAT-B MRP/cMOAT-related ABC transporter MRP4_HUMAN Multidrug resistance-associated protein 4
Type:
PROTEIN
Mol. Mass.:
149546.12
Organism:
Homo sapiens (Human)
Description:
ChEMBL_1486828
Residue:
1325
  
Inhibitor
Name:
BDBM50406795
Synonyms:
Cozaar | LOSARTAN POTASSIUM
Type:
Small organic molecule
Emp. Form.:
C22H22ClN6O
Mol. Mass.:
421.903
SMILES:
CCCCc1nc(Cl)c(CO)n1Cc1ccc(cc1)-c1ccccc1-c1nn[n-]n1
: