Target
ATP-binding cassette sub-family C member 4
Ligand
BDBM50165008
Substrate
Meas. Tech.
ChEMBL_1678647 (CHEMBL4028924)
IC50
>133000±n/a nM
Citation
 Morgan, REvan Staden, CJChen, YKalyanaraman, NKalanzi, JDunn, RTAfshari, CAHamadeh, HK A multifactorial approach to hepatobiliary transporter assessment enables improved therapeutic compound development. Toxicol Sci 136:216-41 (2013)  
Target
Name:
ATP-binding cassette sub-family C member 4
Synonyms:
ABCC4 MOAT-B MRP/cMOAT-related ABC transporter MRP4_HUMAN Multidrug resistance-associated protein 4
Type:
PROTEIN
Mol. Mass.:
149546.12
Organism:
Homo sapiens (Human)
Description:
ChEMBL_1486828
Residue:
1325
  
Inhibitor
Name:
BDBM50165008
Synonyms:
(+)-(R)-2-(alpha-(2-(Diisopropylamino)ethyl)benzyl)-p-cresol 2-[(1R)-3-(diisopropylamino)-1-phenylpropyl]-4-methylphenol TOLTERODINE
Type:
Small organic molecule
Emp. Form.:
C22H31NO
Mol. Mass.:
325.4876
SMILES:
CC(C)N(CC[C@H](c1ccccc1)c1cc(C)ccc1O)C(C)C
: