Target
UDP-3-O-acyl-N-acetylglucosamine deacetylase
Ligand
BDBM50469552
Substrate
Meas. Tech.
ChEMBL_1680060 (CHEMBL4030337)
IC50
98.0±n/a nM
Citation
 Piizzi, GParker, DTPeng, YDobler, MPatnaik, AWattanasin, SLiu, ELenoir, FNunez, JKerrigan, JMcKenney, DOsborne, CYu, DLanieri, LBojkovic, JDzink-Fox, JLilly, MDSprague, ERLu, YWang, HRanjitkar, SXie, LWang, BGlick, MHamann, LGTommasi, RYang, XDean, CR Design, Synthesis, and Properties of a Potent Inhibitor of Pseudomonas aeruginosa Deacetylase LpxC. J Med Chem 60:5002-5014 (2017)  
Target
Name:
UDP-3-O-acyl-N-acetylglucosamine deacetylase
Synonyms:
LPXC_PSEAE UDP-3-O-[3-hydroxymyristoyl] N-acetylglucosamine deacetylase UDP-3-O-[3-hydroxymyristoyl] N-acetylglucosamine deacetylase (LpxC) UDP-3-O-acyl-GlcNAc deacetylase (LpxC) lpxC
Type:
Enzyme
Mol. Mass.:
33428.15
Organism:
Pseudomonas aeruginosa
Description:
P47205
Residue:
303
  
Inhibitor
Name:
BDBM50469552
Synonyms:
CHEMBL4072428
Type:
Small organic molecule
Emp. Form.:
C24H26N4O3
Mol. Mass.:
418.4882
SMILES:
CCc1ccc(cc1)-c1ccc(cc1)C(=O)N[C@@H]([C@@H](C)Nc1cccnc1)C(=O)NO
: