Target
Retinal rod rhodopsin-sensitive cGMP 3',5'-cyclic phosphodiesterase subunit delta
Ligand
BDBM50249988
Substrate
Meas. Tech.
ChEMBL_1680835 (CHEMBL4031112)
Kd
2±n/a nM
Citation
 Jiang, YZhuang, CChen, LLu, JDong, GMiao, ZZhang, WLi, JSheng, C Structural Biology-Inspired Discovery of Novel KRAS-PDE? Inhibitors. J Med Chem 60:9400-9406 (2017)  
Target
Name:
Retinal rod rhodopsin-sensitive cGMP 3',5'-cyclic phosphodiesterase subunit delta
Synonyms:
3',5'-cyclic phosphodiesterase PDE6D PDED Retinal rod rhodopsin-sensitive cGMP 3',5'-cyclic phosphodiesterase subunit delta
Type:
PROTEIN
Mol. Mass.:
17418.30
Organism:
Homo sapiens (Human)
Description:
ChEMBL_105761
Residue:
150
  
Inhibitor
Name:
BDBM50249988
Synonyms:
CHEMBL4061005
Type:
Small organic molecule
Emp. Form.:
C36H36FN7O3
Mol. Mass.:
633.7145
SMILES:
Cc1n(nc2c1c(C)nn(CCC(=O)N1CCC(CC1)N1C(Nc3ccccc3C1=O)c1ccccc1F)c2=O)-c1ccc(C)cc1
: