Target
Retinal rod rhodopsin-sensitive cGMP 3',5'-cyclic phosphodiesterase subunit delta
Ligand
BDBM50249990
Substrate
Meas. Tech.
ChEBML_1680835
Kd
8.0±n/a nM
Citation
 Jiang, YZhuang, CChen, LLu, JDong, GMiao, ZZhang, WLi, JSheng, C Structural Biology-Inspired Discovery of Novel KRAS-PDE? Inhibitors. J Med Chem 60:9400-9406 (2017)  
Target
Name:
Retinal rod rhodopsin-sensitive cGMP 3',5'-cyclic phosphodiesterase subunit delta
Synonyms:
3',5'-cyclic phosphodiesterase PDE6D PDED Retinal rod rhodopsin-sensitive cGMP 3',5'-cyclic phosphodiesterase subunit delta
Type:
PROTEIN
Mol. Mass.:
17418.30
Organism:
Homo sapiens (Human)
Description:
ChEMBL_105761
Residue:
150
  
Inhibitor
Name:
BDBM50249990
Synonyms:
CHEMBL4090022
Type:
Small organic molecule
Emp. Form.:
C33H30F2N4O2
Mol. Mass.:
552.6137
SMILES:
Fc1ccccc1C1Nc2ccccc2C(=O)N1CCCCCN1C(Nc2ccccc2C1=O)c1ccccc1F
: